{"text_format":"1","workbook":"xlsx","n_sheets":7,"sheets":["TITLE","TUBING PORT","TUBING PORT - CV CHART","FULL PORT","FULL PORT - CV CHART","Cv Charts","DATA"],"not_rendered":{"charts":4,"images":1,"macros":1,"external_links":0,"defined_names":7,"comments":0,"pivot_tables":0},"unopened":[{"sheet":"TUBING PORT - CV CHART","index":2,"reason":"not_a_worksheet"},{"sheet":"FULL PORT - CV CHART","index":4,"reason":"not_a_worksheet"}],"bounds":{"document_bytes":16777216,"sheet_cells":100000,"rows_first":2000,"rows_last":500,"rows_between":2000,"halvings":0,"cell_chars":16384,"cell_head_chars":4096},"cells_cut":0,"cells_raw":0,"read":"whole","date_system":"1900"}

{"sheet":"TITLE","index":0,"n_rows":20,"n_cols":1,"rows_kept":20,"cut":false,"hidden":false,"merged":[[0,0,0,1]]}
["PBM 2-WAY VALVE FLOW CALCULATOR"]
[]
["VERSION 2.06"]
["DATE: MARCH 22, 2016"]
[]
["PLEASE SELECT THE TYPE OF VALVE YOU NEED:  "]
[]
[]
[]
[]
[]
[]
["REVISION NOTES:"]
["2.03 - ADDED DATA FOR LP GAS (PROPANE)"]
["2.04 - ADDED SPECIFIC GRAVITY INFO TO MEDIA"]
["NAMES, ADDED DATA FOR DOZENS OF FLUIDS."]
["2.05 - ADDED LIQUIFIED NATURAL GAS AND LIQUID"]
["          NITROGEN"]
["2.06 - CORRECTED FOR LIQUID PRESSURE INPUTS TO"]
["          BE IN PSIG AND RELABELED ACCORDINGLY."]
{"$rows_left_out":1}
{"sheet":"TUBING PORT","index":1,"n_rows":91,"n_cols":27,"rows_kept":91,"cut":false,"hidden":false,"merged":[[29,1,30,1],[29,2,30,2],[29,4,30,4],[29,7,30,7],[29,5,30,5],[29,6,30,6],[29,3,30,3],[24,6,24,9],[8,3,8,4],[6,6,6,9],[1,8,1,9],[11,11,11,13],[12,11,12,13],[21,3,21,4],[14,11,14,13],[17,11,17,13],[25,11,25,13],[24,11,24,13],[18,12,18,13],[21,11,21,13],[22,12,22,13],[0,25,0,26],[0,0,0,3],[16,6,16,9],[5,12,5,13],[13,11,13,13],[7,11,7,13],[10,11,10,13]]}
["TO DETERMINE THE REQUIRED CV:",null,null,null,null,null,null,null,null,null,null,null,null,"Kc =",0.24,null,null,null,null,"Size","ID","wall\nthickness","Outlet\nDiameter","Slot Width",null,"Saturated\nSteam"]
[null,null,null,null,null,null,null,"Select the desired valve size from the following drop-down list:  ","1-1/2\" Tubing Port (1.37)",null,null,null,null,"Cf =",0.6,null,{"$f":"DATA!A89","v":"WATER [S.G. 1.000]"},{"$f":"DATA!F3","v":"AIR [S.G. 1.0000]"},null,"1/2\" Tubing Port (0.37)",0.37,6.5000000000000002E-2,0.37,"1/16\" Slot Upstream",null,"PSI","°F"]
[null,null,null,null,null,null,null,null,null,null,null,null,null,"T (°C) =",{"$f":"5/9*(E10-32)","v":-17.777777777777779},null,{"$f":"DATA!A2","v":"ACETIC ACID [S.G. 1.052]"},{"$f":"DATA!F2","v":"ACETYLENE [S.G. 0.903]"},null,"3/4\" Tubing Port (0.62)",0.62,6.5000000000000002E-2,0.62,"1/8\" Slot Upstream",null,0.11599999999999999,38.840000000000003]
[null,null,null,null,null,null,null,null,null,null,null,null,null,"T (°K) =",{"$f":"273+O3","v":255.22222222222223},null,{"$f":"DATA!A3","v":"ACETONE [S.G. 0.787]"},{"$f":"DATA!F4","v":"AMMONIA [S.G. 0.589]"},null,"1\" Tubing Port (0.87)",0.87,6.5000000000000002E-2,0.87,"3/16\" Slot Upstream",null,0.28999999999999998,63.5]
[null,"ENTER VALUES (LIQUID)",null,null,null,null,"DO NOT ENTER DATA HERE",null,null,null,null,null,null,"e =",2.7182818284590402,null,{"$f":"DATA!A4","v":"ACETYLENE, LIQUID [S.G. 0.900]"},{"$f":"DATA!F5","v":"ARGON [S.G. 1.374]"},null,"1-1/2\" Tubing Port (1.37)",1.37,6.5000000000000002E-2,1.37,"3/8\" Slot Upstream",null,0.72499999999999998,91.22]
[null,"UPSTREAM PRESSURE (PSIG)",null,null,null,null,"PRESSURE DROP (PSI)",null,null,{"$f":"E6-E7","v":0},null,null,"Critical Pressure (Pc)",null,{"$f":"LOOKUP(D9,DATA!A2:A91,DATA!B2:B91)","v":{"$error":"#N/A"}},null,{"$f":"DATA!A5","v":"ALCOHOL [S.G. 0.802]"},{"$f":"DATA!F6","v":"CARBON DIOXIDE [S.G. 1.531]"},null,"2\" Tubing Port (1.87)",1.87,6.5000000000000002E-2,1.87,"3/8\" Slot Upstream",null,1.45,114.44]
[null,"DOWNSTREAM PRESSURE (PSIG)",null,null,null,null,{"$f":"IF(J6=0,\"\",(IF(AND(J6<J10,J6>J9),\"Incipient cavitation is expected\",IF(J6>J10,\"Cavitation will occur\",\"\"))))","v":""},null,null,null,null,null,null,"Coeff. of Incipient Cavitation (Kc - psia)",{"$f":"O1","v":0.24},null,{"$f":"DATA!A6","v":"ALCOHOL, ETHYL (ETHANOL) [S.G. 0.787]"},{"$f":"DATA!F7","v":"CARBON MONOXIDE [S.G. 0.969]"},null,"2-1/2\" Tubing Port (2.37)",2.37,6.5000000000000002E-2,2.37,"3/8\" Slot Upstream",null,2.9,140.18]
[null,"FLOW RATE (GPM)",null,null,null,null,"REQUIRED CV",null,null,{"$f":"E8*(SQRT(IF((LOOKUP(D9,DATA!A2:A91,DATA!C2:C91))=0,1,(LOOKUP(D9,DATA!A2:A91,DATA!C2:C91)))/J6))","v":{"$error":"#N/A"}},null,"Critical Flow Factor (Cf)",null,null,{"$f":"O2","v":0.6},null,{"$f":"DATA!A7","v":"ALCOHOL, METHYL (METHANOL) [S.G. 0.791]"},{"$f":"DATA!F8","v":"ETHANE [S.G. 2.487]"},null,"3\" Tubing Port (2.87)",2.87,6.5000000000000002E-2,2.87,"5/8\" Slot Upstream",null,4.0599999999999996,153.5]
[null,"FLUID",null,null,null,null,"∆P incipient cavitation",null,null,{"$f":"O7*O10","v":{"$error":"#N/A"}},null,null,null,"Vapor Pressure (psia) of fluid at temp.",{"$f":"((O5^(77.345+(0.0057*O4)-(7235/O4)))/O4^8.2)*0.0001450377","v":2.1664092211931982E-2},null,{"$f":"DATA!A8","v":"ALCOHOL, PROPYL [S.G. 0.802]"},{"$f":"DATA!F9","v":"ETHYLENE [S.G. 1.047]"},null,"4\" Tubing Port (3.83)",3.83,8.5000000000000006E-2,3.83,"3/4\" Slot Upstream",null,5.0750000000000002,162.86000000000001]
[null,"Temperature (°F)",null,null,null,null,"∆P critical",null,null,{"$f":"O8^2*O10","v":{"$error":"#N/A"}},null,null,null,"∆Ps (psia)",{"$f":"O15-(0.96-0.28*(SQRT(O9/O6)))*O9","v":{"$error":"#N/A"}},null,{"$f":"DATA!A9","v":"AMMONIA (AQUA) [S.G. 0.826]"},{"$f":"DATA!F10","v":"HELIUM [S.G. 0.144]"},null,"6\" Tubing Port (5.78)",5.78,0.11,5.78,"1\" Slot Upstream",null,6.5250000000000004,173.66]
[null,null,null,null,null,null,null,null,null,null,null,"valve outlet diameter (in)",null,null,{"$f":"VLOOKUP(I2,T1:X10,4,FALSE)","v":1.37},null,{"$f":"DATA!A10","v":"ANILINE [S.G. 1.022]"},{"$f":"DATA!F11","v":"HYDROGEN [S.G. 0.065]"},null,null,null,null,null,null,null,7.9749999999999996,182.66]
[null,null,null,null,null,null,null,null,null,null,null,"SLg (gas property factor) =",null,null,{"$f":"LOOKUP(E22,DATA!F2:F15,DATA!H2:H15)","v":{"$error":"#N/A"}},null,{"$f":"DATA!A11","v":"BENZENE [S.G. 0.876]"},{"$f":"DATA!F12","v":"METHANE [S.G. 0.550]"},null,null,null,null,null,null,null,9.4250000000000007,190.4]
[null,"ENTER VALUES (SATURATED STEAM)",null,null,null,null,"DO NOT ENTER DATA HERE",null,null,null,null,"G specific gravity gas =",null,null,{"$f":"LOOKUP(E22,DATA!F2:F15,DATA!I2:I15)","v":{"$error":"#N/A"}},null,{"$f":"DATA!A12","v":"BENZOL  [S.G. 0.877]"},{"$f":"DATA!F13","v":"NITROGEN [S.G. 0.969]"},null,null,null,null,null,null,null,10.875,197.24]
[null,"UPSTREAM PRESSURE (PSIA)",null,null,null,null,"PRESSURE DROP (PSI)",null,null,{"$f":"E14-E15","v":0},null,"Flowing temperature (°R) =",null,null,{"$f":"E25+459.67","v":459.67},null,{"$f":"DATA!A13","v":"BROMINE [S.G. 3.12]"},{"$f":"DATA!F14","v":"OXYGEN [S.G. 1.099]"},null,null,null,null,null,null,null,12.324999999999999,203.36]
[null,"DOWNSTREAM PRESSURE (PSIA)",null,null,null,null,"REQUIRED CV",null,null,{"$f":"0+IF(J14<0.5*0.36*E14,E16/(2.1*(J14*(E14+E15))^0.5),E16/(1.83*0.6*E14))","v":{"$error":"#DIV/0!"}},null,"Convert Upstream Pressure to PSIA =",null,null,{"$f":"($E$6)+14.7","v":14.7},null,{"$f":"DATA!A14","v":"BUTANE [S.G. 0.601]"},{"$f":"DATA!F15","v":"PROPANE [S.G. 1.531]"},null,null,null,null,null,null,null,13.775,208.76]
[null,"FLOW RATE (LB/HR)",null,null,null,null,"Temp of saturated steam (°F)",null,null,{"$f":"LOOKUP(E14,Z3:Z61,AA3:AA61)","v":{"$error":"#N/A"}},null,null,null,null,null,null,{"$f":"DATA!A15","v":"CARBON DISULFIDE [S.G. 1.265]"},null,null,null,null,null,null,null,null,14.5,211.28]
[null,null,null,null,null,null,{"$f":"IF(O19<0.33,\"Sound generated at the outlet is negligible\",IF(O19>=1,\"High Mach number; Select a larger valve size\",\"Please determine if sound level below is OK\"))","v":{"$error":"#N/A"}},null,null,null,null,null,null,"For steam:",null,null,{"$f":"DATA!A16","v":"CARBON TETRACHLORIDE [S.G. 1.589]"},null,null,null,null,null,null,null,null,14.692849999999998,212]
[null,null,null,null,null,null,"Predicted noise level (dBA)",null,null,{"$f":"10*LOG((80*(E15^2)*(O11^2)*(O25^2)*(O19^8)*(1+0.0007*J16)^6)/(O26^3))","v":{"$error":"#N/A"}},null,"Min. valve outlet diameter (in)",null,null,{"$f":"0.119*(SQRT((E16*(1+0.0007*J16))/E15))","v":{"$error":"#N/A"}},null,{"$f":"DATA!A17","v":"CARENE [0.860]"},null,null,null,null,null,null,null,null,15.95,216.14]
[null,null,null,null,null,null,null,null,null,null,null,null,"Mach number",null,{"$f":"(0.014*(E16*(1+0.0007*J16)))/(E15*O11^2)","v":{"$error":"#N/A"}},null,{"$f":"DATA!A18","v":"CHLORINE [S.G. 1.564]"},null,null,null,null,null,null,null,null,18.850000000000001,224.78]
[null,null,null,null,null,null,null,null,null,null,null,null,null,null,null,null,{"$f":"DATA!A19","v":"CHLOROFORM [S.G. 1.469]"},null,null,null,null,null,null,null,null,21.75,232.52]
{"$rows_left_out":72}
{"sheet":"FULL PORT","index":3,"n_rows":91,"n_cols":28,"rows_kept":91,"cut":false,"hidden":false,"merged":[[29,1,30,1],[29,2,30,2],[29,4,30,4],[29,7,30,7],[29,5,30,5],[29,6,30,6],[29,3,30,3],[0,0,0,3],[16,6,16,9],[24,6,24,9],[8,3,8,4],[6,6,6,9],[1,8,1,9],[1,0,1,7],[2,0,2,7],[21,3,21,4],[5,12,5,13],[25,11,25,13],[24,11,24,13],[17,11,17,13],[18,12,18,13],[21,11,21,13],[22,12,22,13],[13,11,13,13],[7,11,7,13],[10,11,10,13],[11,11,11,13],[12,11,12,13],[6,10,6,13],[8,10,8,13],[14,11,14,13]]}
["TO DETERMINE THE REQUIRED CV:",null,null,null,null,null,null,null,null,null,null,null,null,"Kc =",0.24,null,null,null,null,"Size","Outlet\nDiameter","Slot Width",null,"Size","Schedule","OD","Thickness","ID"]
["Select the desired valve size from the following drop-down list:  ",null,null,null,null,null,null,null,null,null,null,null,null,"Cf =",0.6,null,{"$f":"DATA!A89","v":"WATER [S.G. 1.000]"},{"$f":"DATA!F3","v":"AIR [S.G. 1.0000]"},null,"1/2\" Full Port",0.5,"1/8\" Slot Upstream",null,"1/2\" Full Port",5,0.84,6.5000000000000002E-2,{"$f":"Z2-2*AA2","v":0.71}]
["Select the pipe schedule from the following drop-down list:  ",null,null,null,null,null,null,null,null,null,null,null,null,"T (°C) =",{"$f":"5/9*(E10-32)","v":-17.777777777777779},null,{"$f":"DATA!A2","v":"ACETIC ACID [S.G. 1.052]"},{"$f":"DATA!F2","v":"ACETYLENE [S.G. 0.903]"},null,"3/4\" Full Port",0.75,"1/8\" Slot Upstream",null,{"$f":"$T$2","v":"1/2\" Full Port"},10,0.84,8.3000000000000004E-2,{"$f":"Z3-2*AA3","v":0.67399999999999993}]
[null,null,null,null,null,null,null,null,null,null,null,null,null,"T (°K) =",{"$f":"273+O3","v":255.22222222222223},null,{"$f":"DATA!A3","v":"ACETONE [S.G. 0.787]"},{"$f":"DATA!F4","v":"AMMONIA [S.G. 0.589]"},null,"1\" Full Port",1,"3/16\" Slot Upstream",null,{"$f":"$T$2","v":"1/2\" Full Port"},40,0.84,0.109,0.622]
[null,"ENTER VALUES (LIQUID)",null,null,null,null,"DO NOT ENTER DATA HERE",null,null,null,null,null,null,"e =",2.7182818284590402,null,{"$f":"DATA!A4","v":"ACETYLENE, LIQUID [S.G. 0.900]"},{"$f":"DATA!F5","v":"ARGON [S.G. 1.374]"},null,"1-1/2\" Full Port",1.5,"3/8\" Slot Upstream",null,{"$f":"$T$2","v":"1/2\" Full Port"},80,0.84,0.14699999999999999,0.54600000000000004]
[null,"UPSTREAM PRESSURE (PSIG)",null,null,null,null,"PRESSURE DROP (PSI)",null,null,{"$f":"E6-E7","v":0},null,null,"Critical Pressure (Pc)",null,{"$f":"LOOKUP(D9,DATA!A2:A91,DATA!B2:B91)","v":{"$error":"#N/A"}},null,{"$f":"DATA!A5","v":"ALCOHOL [S.G. 0.802]"},{"$f":"DATA!F6","v":"CARBON DIOXIDE [S.G. 1.531]"},null,"2\" Full Port",2,"3/8\" Slot Upstream",null,"3/4\" Full Port",{"$f":"$Y$2","v":5},1.05,6.5000000000000002E-2,0.92]
[null,"DOWNSTREAM PRESSURE (PSIG)",null,null,null,null,{"$f":"IF(J6=0,\"\",(IF(AND(J6<J10,J6>J9),\"Incipient cavitation is expected\",IF(J6>J10,\"Cavitation will occur\",\"\"))))","v":""},null,null,null,"Coeff. of Incipient Cavitation (Kc - psia)",null,null,null,{"$f":"O1","v":0.24},null,{"$f":"DATA!A6","v":"ALCOHOL, ETHYL (ETHANOL) [S.G. 0.787]"},{"$f":"DATA!F7","v":"CARBON MONOXIDE [S.G. 0.969]"},null,"2-1/2\" Full Port",2.5,"3/8\" Slot Upstream",null,{"$f":"$T$3","v":"3/4\" Full Port"},{"$f":"$Y$3","v":10},1.05,8.3000000000000004E-2,0.88400000000000001]
[null,"FLOW RATE (GPM)",null,null,null,null,"REQUIRED CV",null,null,{"$f":"E8*(SQRT(IF((LOOKUP(D9,DATA!A2:A91,DATA!C2:C91))=0,1,(LOOKUP(D9,DATA!A2:A91,DATA!C2:C91)))/J6))","v":{"$error":"#N/A"}},null,"Critical Flow Factor (Cf)",null,null,{"$f":"O2","v":0.6},null,{"$f":"DATA!A7","v":"ALCOHOL, METHYL (METHANOL) [S.G. 0.791]"},{"$f":"DATA!F8","v":"ETHANE [S.G. 2.487]"},null,"3\" Full Port",3,"5/8\" Slot Upstream",null,{"$f":"$T$3","v":"3/4\" Full Port"},{"$f":"$Y$4","v":40},1.05,0.113,0.82400000000000007]
[null,"FLUID",null,null,null,null,"∆P incipient cavitation",null,null,{"$f":"O7*O10","v":{"$error":"#N/A"}},"Vapor Pressure (psia) of fluid at temp.",null,null,null,{"$f":"((O5^(77.345+(0.0057*O4)-(7235/O4)))/O4^8.2)*0.0001450377","v":2.1664092211931982E-2},null,{"$f":"DATA!A8","v":"ALCOHOL, PROPYL [S.G. 0.802]"},{"$f":"DATA!F9","v":"ETHYLENE [S.G. 1.047]"},null,"4\" Full Port",4,"3/4\" Slot Upstream",null,{"$f":"$T$3","v":"3/4\" Full Port"},{"$f":"$Y$5","v":80},1.05,0.154,0.74199999999999999]
[null,"Temperature (°F)",null,null,null,null,"∆P critical",null,null,{"$f":"O8^2*O10","v":{"$error":"#N/A"}},null,null,null,"∆Ps (psia)",{"$f":"O15-(0.96-0.28*(SQRT(O9/O6)))*O9","v":{"$error":"#N/A"}},null,{"$f":"DATA!A9","v":"AMMONIA (AQUA) [S.G. 0.826]"},{"$f":"DATA!F10","v":"HELIUM [S.G. 0.144]"},null,"6\" Full Port",6,"1\" Slot Upstream",null,"1\" Full Port",{"$f":"$Y$2","v":5},1.3149999999999999,6.5000000000000002E-2,1.1850000000000001]
[null,null,null,null,null,null,null,null,null,null,null,"valve outlet diameter (in)",null,null,{"$f":"VLOOKUP(I2,T1:V10,2,FALSE)","v":{"$error":"#N/A"}},null,{"$f":"DATA!A10","v":"ANILINE [S.G. 1.022]"},{"$f":"DATA!F11","v":"HYDROGEN [S.G. 0.065]"},null,"8\" Full Port",8,null,null,{"$f":"$T$4","v":"1\" Full Port"},{"$f":"$Y$3","v":10},1.3149999999999999,0.109,1.097]
[null,null,null,null,null,null,null,null,null,null,null,"SLg (gas property factor) =",null,null,{"$f":"LOOKUP(E22,DATA!F2:F15,DATA!H2:H15)","v":{"$error":"#N/A"}},null,{"$f":"DATA!A11","v":"BENZENE [S.G. 0.876]"},{"$f":"DATA!F12","v":"METHANE [S.G. 0.550]"},null,null,null,null,null,{"$f":"$T$4","v":"1\" Full Port"},{"$f":"$Y$4","v":40},1.3149999999999999,0.13300000000000001,1.0489999999999999]
[null,"ENTER VALUES (SATURATED STEAM)",null,null,null,null,"DO NOT ENTER DATA HERE",null,null,null,null,"G specific gravity gas =",null,null,{"$f":"LOOKUP(E22,DATA!F2:F15,DATA!I2:I15)","v":{"$error":"#N/A"}},null,{"$f":"DATA!A12","v":"BENZOL  [S.G. 0.877]"},{"$f":"DATA!F13","v":"NITROGEN [S.G. 0.969]"},null,null,null,null,null,{"$f":"$T$4","v":"1\" Full Port"},{"$f":"$Y$5","v":80},1.3149999999999999,0.17899999999999999,0.95699999999999996]
[null,"UPSTREAM PRESSURE (PSIA)",null,null,null,null,"PRESSURE DROP (PSI)",null,null,{"$f":"E14-E15","v":0},null,"Flowing temperature (°R) =",null,null,{"$f":"E25+459.67","v":459.67},null,{"$f":"DATA!A13","v":"BROMINE [S.G. 3.12]"},{"$f":"DATA!F14","v":"OXYGEN [S.G. 1.099]"},null,null,null,null,null,"1-1/2\" Full Port",{"$f":"$Y$2","v":5},1.9,6.5000000000000002E-2,1.77]
[null,"DOWNSTREAM PRESSURE (PSIA)",null,null,null,null,"REQUIRED CV",null,null,{"$f":"0+IF(J14<0.5*0.36*E14,E16/(2.1*(J14*(E14+E15))^0.5),E16/(1.83*0.6*E14))","v":{"$error":"#DIV/0!"}},null,"Upstream pressure converted to PSIA =",null,null,{"$f":"($E$6)+14.7","v":14.7},null,{"$f":"DATA!A14","v":"BUTANE [S.G. 0.601]"},{"$f":"DATA!F15","v":"PROPANE [S.G. 1.531]"},null,null,null,null,null,{"$f":"$T$5","v":"1-1/2\" Full Port"},{"$f":"$Y$3","v":10},1.9,0.109,1.6819999999999999]
[null,"FLOW RATE (LB/HR)",null,null,null,null,"Temp of saturated steam (°F)",null,null,{"$f":"LOOKUP(E14,DATA!L3:L61,DATA!M3:M61)","v":{"$error":"#N/A"}},null,null,null,null,null,null,{"$f":"DATA!A15","v":"CARBON DISULFIDE [S.G. 1.265]"},null,null,null,null,null,null,{"$f":"$T$5","v":"1-1/2\" Full Port"},{"$f":"$Y$4","v":40},1.9,0.14499999999999999,1.6099999999999999]
[null,null,null,null,null,null,{"$f":"IF(O19<0.33,\"Sound generated at the outlet is negligible\",IF(O19>=1,\"High Mach number; Select a larger valve size\",\"Please determine if sound level below is OK\"))","v":{"$error":"#N/A"}},null,null,null,null,null,null,"For steam:",null,null,{"$f":"DATA!A16","v":"CARBON TETRACHLORIDE [S.G. 1.589]"},null,null,null,null,null,null,{"$f":"$T$5","v":"1-1/2\" Full Port"},{"$f":"$Y$5","v":80},1.9,0.2,1.5]
[null,null,null,null,null,null,"Predicted noise level (dBA)",null,null,{"$f":"10*LOG((80*(E15^2)*(O11^2)*(O25^2)*(O19^8)*(1+0.0007*I3)^6)/(O26^3))","v":{"$error":"#N/A"}},null,"Min. valve outlet diameter (in)",null,null,{"$f":"0.119*(SQRT((E16*(1+0.0007*J16))/E15))","v":{"$error":"#N/A"}},null,{"$f":"DATA!A17","v":"CARENE [0.860]"},null,null,null,null,null,null,"2\" Full Port",{"$f":"$Y$2","v":5},2.375,6.5000000000000002E-2,2.2450000000000001]
[null,null,null,null,null,null,null,null,null,null,null,null,"Mach number",null,{"$f":"(0.014*(E16*(1+0.0007*I3)))/(E15*O11^2)","v":{"$error":"#N/A"}},null,{"$f":"DATA!A18","v":"CHLORINE [S.G. 1.564]"},null,null,null,null,null,null,{"$f":"$T$6","v":"2\" Full Port"},{"$f":"$Y$3","v":10},2.375,0.109,2.157]
[null,null,null,null,null,null,null,null,null,null,null,null,null,null,null,null,{"$f":"DATA!A19","v":"CHLOROFORM [S.G. 1.469]"},null,null,null,null,null,null,{"$f":"$T$6","v":"2\" Full Port"},{"$f":"$Y$4","v":40},2.375,0.154,2.0670000000000002]
{"$rows_left_out":72}
{"sheet":"Cv Charts","index":5,"n_rows":418,"n_cols":8,"rows_kept":418,"cut":false,"hidden":true,"merged":[]}
["Size","Percent\nOpen","Degrees\nOpen",{"$f":"A1","v":"Size"},"60 V\nUpstream","45 V\nUpstream","30 V\nUpstream","1/16\" Slot Upstream"]
["1/2\" Tubing Port (0.37)",0,{"$f":"B2*0.9","v":0},0,0,0,0,0]
["1/2\" Tubing Port (0.37)",5,4.5,0,0,0,0,0]
["1/2\" Tubing Port (0.37)",10,9,0,0,0,0,0]
["1/2\" Tubing Port (0.37)",15,13.5,1.5466666666666668E-2,0,0,0,0]
["1/2\" Tubing Port (0.37)",20,18,6.3799999999999996E-2,0,0,0,0]
["1/2\" Tubing Port (0.37)",25,22.5,0.11020000000000001,0,0,0,0]
["1/2\" Tubing Port (0.37)",30,27,0.12373333333333335,0,0,0,0]
["1/2\" Tubing Port (0.37)",35,31.5,0.16433333333333333,0,0,0,0]
["1/2\" Tubing Port (0.37)",40,36,0.25133333333333335,0,0,0,0]
["1/2\" Tubing Port (0.37)",45,40.5,0.36733333333333335,2.7E-2,5.0000000000000001E-3,5.0000000000000001E-3,5.1999999999999998E-2]
["1/2\" Tubing Port (0.37)",50,45,0.46400000000000002,0.05,0.05,0.05,0.1]
["1/2\" Tubing Port (0.37)",55,49.5,0.56066666666666665,0.13,0.08,0.08,0.17]
["1/2\" Tubing Port (0.37)",60,54,0.69599999999999995,0.32,0.25,0.25,0.25]
["1/2\" Tubing Port (0.37)",65,58.5,0.92800000000000005,0.57999999999999996,0.39,0.39,0.39]
["1/2\" Tubing Port (0.37)",70,63,1.1986666666666668,0.9,0.6,0.6,0.53]
["1/2\" Tubing Port (0.37)",75,67.5,1.5853333333333333,1.3,0.88,0.83,0.63]
["1/2\" Tubing Port (0.37)",80,72,2.0880000000000001,1.7,1.3,1.2,0.75]
["1/2\" Tubing Port (0.37)",85,76.5,2.726,2.8,1.8,1.3,0.87]
["1/2\" Tubing Port (0.37)",90,81,3.5379999999999998,4.3,3,1.8,0.93]
{"$rows_left_out":399}
{"sheet":"DATA","index":6,"n_rows":113,"n_cols":13,"rows_kept":113,"cut":false,"hidden":true,"merged":[[0,11,0,12]]}
["Compound"," Pc Critical\nPressure (psia)","Specific\ngravity","Fluid Type",null,"Compound"," Pc Critical\nPressure (psia)","Gas Property\nFactor - SLg","Specific\ngravity","Fluid Type",null,"Saturated\nSteam"]
["ACETIC ACID [S.G. 1.052]",840,1.052,"LIQUID",null,"ACETYLENE [S.G. 0.903]",911,-0.5,0.9,"GAS",null,"PSI","°F"]
["ACETONE [S.G. 0.787]",691,0.78700000000000003,"LIQUID",null,"AIR [S.G. 1.0000]",547,0,1,"GAS",null,0.11599999999999999,38.840000000000003]
["ACETYLENE, LIQUID [S.G. 0.900]",911,0.9,"LIQUID",null,"AMMONIA [S.G. 0.589]",1638,1.5,0.59,"GAS",null,0.28999999999999998,63.5]
["ALCOHOL [S.G. 0.802]",956,0.80200000000000005,"LIQUID",null,"ARGON [S.G. 1.374]",705,null,1.38,"GAS",null,0.72499999999999998,91.22]
["ALCOHOL, ETHYL (ETHANOL) [S.G. 0.787]",914,0.78700000000000003,"LIQUID",null,"CARBON DIOXIDE [S.G. 1.531]",1072,-3,1.5188999999999999,"GAS",null,1.45,114.44]
["ALCOHOL, METHYL (METHANOL) [S.G. 0.791]",1168,0.79100000000000004,"LIQUID",null,"CARBON MONOXIDE [S.G. 0.969]",514,0,0.9667,"GAS",null,2.9,140.18]
["ALCOHOL, PROPYL [S.G. 0.802]",750,0.80200000000000005,"LIQUID",null,"ETHANE [S.G. 2.487]",717,-2,1.0378000000000001,"GAS",null,4.0599999999999996,153.5]
["AMMONIA (AQUA) [S.G. 0.826]",1636,0.82599999999999996,"LIQUID",null,"ETHYLENE [S.G. 1.047]",731,-1.5,0.97840000000000005,"GAS",null,5.0750000000000002,162.86000000000001]
["ANILINE [S.G. 1.022]",824,1.022,"LIQUID",null,"HELIUM [S.G. 0.144]",33.200000000000003,-9,0.13800000000000001,"GAS",null,6.5250000000000004,173.66]
["BENZENE [S.G. 0.876]",701,0.876,"LIQUID",null,"HYDROGEN [S.G. 0.065]",188,-9,6.9599999999999995E-2,"GAS",null,7.9749999999999996,182.66]
["BENZOL  [S.G. 0.877]",735,0.877,"LIQUID",null,"METHANE [S.G. 0.550]",673,2,0.55369999999999997,"GAS",null,9.4250000000000007,190.4]
["BROMINE [S.G. 3.12]",1494,3.12,"LIQUID",null,"NITROGEN [S.G. 0.969]",492,0,0.96689999999999998,"GAS",null,10.875,197.24]
["BUTANE [S.G. 0.601]",529,0.60099999999999998,"LIQUID",null,"OXYGEN [S.G. 1.099]",730,-0.5,1.1044,"GAS",null,12.324999999999999,203.36]
["CARBON DISULFIDE [S.G. 1.265]",1116,1.2649999999999999,"LIQUID",null,"PROPANE [S.G. 1.531]",617,-4.5,1.5219,"GAS",null,13.775,208.76]
["CARBON TETRACHLORIDE [S.G. 1.589]",661,1.589,"LIQUID",null,null,null,null,null,null,null,14.5,211.28]
["CARENE [0.860]",428,0.86,"LIQUID",null,null,null,null,null,null,null,14.692849999999998,212]
["CHLORINE [S.G. 1.564]",1118,1.5640000000000001,"LIQUID",null,null,null,null,null,null,null,15.95,216.14]
["CHLOROFORM [S.G. 1.469]",787,1.4690000000000001,"LIQUID",null,null,null,null,null,null,null,18.850000000000001,224.78]
["COCONUT OIL [S.G. 0.925]",91.3,0.92500000000000004,"LIQUID",null,null,null,null,null,null,null,21.75,232.52]
{"$rows_left_out":93}